Information card for entry 7220560
Formula | Mo O5 Pb2 |
Calculated formula | Mo O5 Pb2 |
Title of publication | The low thermal gradient Czochralski crystal growth and microstructural properties of a Pb2MoO5(20−1) cleaved surface |
Authors of publication | Atuchin, V. V.; Ivannikova, N. V.; Komonov, A. I.; Kuratieva, N. V.; Loshkarev, I. D.; Pervukhina, N. V.; Pokrovsky, L. D.; Shlegel, V. N. |
Journal of publication | CrystEngComm |
Year of publication | 2015 |
Journal volume | 17 |
Journal issue | 24 |
Pages of publication | 4512 |
a | 14.2221 ± 0.0011 Å |
b | 5.7852 ± 0.0005 Å |
c | 7.3262 ± 0.0006 Å |
α | 90° |
β | 114.168 ± 0.002° |
γ | 90° |
Cell volume | 549.95 ± 0.08 Å3 |
Cell temperature | 293 ± 2 K |
Ambient diffraction temperature | 293 ± 2 K |
Number of distinct elements | 3 |
Space group number | 12 |
Hermann-Mauguin space group symbol | C 1 2/m 1 |
Hall space group symbol | -C 2y |
Residual factor for all reflections | 0.0358 |
Residual factor for significantly intense reflections | 0.0336 |
Weighted residual factors for significantly intense reflections | 0.0834 |
Weighted residual factors for all reflections included in the refinement | 0.0851 |
Goodness-of-fit parameter for all reflections included in the refinement | 1.036 |
Diffraction radiation wavelength | 0.71073 Å |
Diffraction radiation type | MoKα |