Information card for entry 7220602
Formula | C6 H6 Cd N10 O2 S |
Calculated formula | C6 H6 Cd N10 O2 S |
Title of publication | Syntheses, structures, luminescence and magnetic properties of eleven coordination polymers constructed by a N,N′-sulfuryldiimidazole ligand |
Authors of publication | Liu, Kang; Ma, Benhua; Guo, Xiaolei; Ma, Dingxuan; Meng, Lingkun; Zeng, Guang; Yang, Fen; Li, Guanghua; Shi, Zhan; Feng, Shouhua |
Journal of publication | CrystEngComm |
Year of publication | 2015 |
Journal volume | 17 |
Journal issue | 27 |
Pages of publication | 5054 |
a | 6.6171 ± 0.0004 Å |
b | 10.0019 ± 0.0006 Å |
c | 10.9248 ± 0.0007 Å |
α | 64.702 ± 0.003° |
β | 80.817 ± 0.004° |
γ | 88.608 ± 0.004° |
Cell volume | 644.54 ± 0.07 Å3 |
Cell temperature | 293 ± 2 K |
Ambient diffraction temperature | 293 ± 2 K |
Number of distinct elements | 6 |
Space group number | 2 |
Hermann-Mauguin space group symbol | P -1 |
Hall space group symbol | -P 1 |
Residual factor for all reflections | 0.0239 |
Residual factor for significantly intense reflections | 0.0226 |
Weighted residual factors for significantly intense reflections | 0.0613 |
Weighted residual factors for all reflections included in the refinement | 0.0625 |
Goodness-of-fit parameter for all reflections included in the refinement | 1.093 |
Diffraction radiation wavelength | 0.71073 Å |
Diffraction radiation type | MoKα |