Information card for entry 7220603
Formula | C3 H3 Mn0.5 N5 O S0.5 |
Calculated formula | C3 H3 Mn0.5 N5 O S0.5 |
Title of publication | Syntheses, structures, luminescence and magnetic properties of eleven coordination polymers constructed by a N,N′-sulfuryldiimidazole ligand |
Authors of publication | Liu, Kang; Ma, Benhua; Guo, Xiaolei; Ma, Dingxuan; Meng, Lingkun; Zeng, Guang; Yang, Fen; Li, Guanghua; Shi, Zhan; Feng, Shouhua |
Journal of publication | CrystEngComm |
Year of publication | 2015 |
Journal volume | 17 |
Journal issue | 27 |
Pages of publication | 5054 |
a | 9.3444 ± 0.0019 Å |
b | 17.647 ± 0.004 Å |
c | 7.356 ± 0.0015 Å |
α | 90° |
β | 90° |
γ | 90° |
Cell volume | 1213 ± 0.4 Å3 |
Cell temperature | 293 ± 2 K |
Ambient diffraction temperature | 293 ± 2 K |
Number of distinct elements | 6 |
Space group number | 62 |
Hermann-Mauguin space group symbol | P n m a |
Hall space group symbol | -P 2ac 2n |
Residual factor for all reflections | 0.026 |
Residual factor for significantly intense reflections | 0.023 |
Weighted residual factors for significantly intense reflections | 0.0565 |
Weighted residual factors for all reflections included in the refinement | 0.0576 |
Goodness-of-fit parameter for all reflections included in the refinement | 1.089 |
Diffraction radiation wavelength | 0.71073 Å |
Diffraction radiation type | MoKα |