Information card for entry 7220605
Formula | C13 H9 Cd N2 O8 S0.5 |
Calculated formula | C13 H9 Cd N2 O8 S0.5 |
Title of publication | Syntheses, structures, luminescence and magnetic properties of eleven coordination polymers constructed by a N,N′-sulfuryldiimidazole ligand |
Authors of publication | Liu, Kang; Ma, Benhua; Guo, Xiaolei; Ma, Dingxuan; Meng, Lingkun; Zeng, Guang; Yang, Fen; Li, Guanghua; Shi, Zhan; Feng, Shouhua |
Journal of publication | CrystEngComm |
Year of publication | 2015 |
Journal volume | 17 |
Journal issue | 27 |
Pages of publication | 5054 |
a | 18.592 ± 0.004 Å |
b | 8.3621 ± 0.0017 Å |
c | 19.857 ± 0.004 Å |
α | 90° |
β | 100.14 ± 0.03° |
γ | 90° |
Cell volume | 3038.9 ± 1.1 Å3 |
Cell temperature | 293 ± 2 K |
Ambient diffraction temperature | 293 ± 2 K |
Number of distinct elements | 6 |
Space group number | 15 |
Hermann-Mauguin space group symbol | C 1 2/c 1 |
Hall space group symbol | -C 2yc |
Residual factor for all reflections | 0.0543 |
Residual factor for significantly intense reflections | 0.039 |
Weighted residual factors for significantly intense reflections | 0.0804 |
Weighted residual factors for all reflections included in the refinement | 0.0858 |
Goodness-of-fit parameter for all reflections included in the refinement | 1.046 |
Diffraction radiation wavelength | 0.71073 Å |
Diffraction radiation type | MoKα |