Information card for entry 7220604
Formula | C6 H6 Cl0 N4 Ni0.5 O4 S1.5 |
Calculated formula | C6 H6 N4 Ni0.5 O4 S1.5 |
Title of publication | Syntheses, structures, luminescence and magnetic properties of eleven coordination polymers constructed by a N,N′-sulfuryldiimidazole ligand |
Authors of publication | Liu, Kang; Ma, Benhua; Guo, Xiaolei; Ma, Dingxuan; Meng, Lingkun; Zeng, Guang; Yang, Fen; Li, Guanghua; Shi, Zhan; Feng, Shouhua |
Journal of publication | CrystEngComm |
Year of publication | 2015 |
Journal volume | 17 |
Journal issue | 27 |
Pages of publication | 5054 |
a | 17.052 ± 0.003 Å |
b | 10.831 ± 0.002 Å |
c | 12.777 ± 0.003 Å |
α | 90° |
β | 119.06 ± 0.03° |
γ | 90° |
Cell volume | 2062.7 ± 0.9 Å3 |
Cell temperature | 293 ± 2 K |
Ambient diffraction temperature | 293 ± 2 K |
Number of distinct elements | 7 |
Space group number | 15 |
Hermann-Mauguin space group symbol | C 1 2/c 1 |
Hall space group symbol | -C 2yc |
Residual factor for all reflections | 0.0562 |
Residual factor for significantly intense reflections | 0.0389 |
Weighted residual factors for significantly intense reflections | 0.0847 |
Weighted residual factors for all reflections included in the refinement | 0.0904 |
Goodness-of-fit parameter for all reflections included in the refinement | 1.089 |
Diffraction radiation wavelength | 0.71073 Å |
Diffraction radiation type | MoKα |