Information card for entry 7220661
Formula | C26 H32 B2 Cu2 F8 Hg2 N6 O2 |
Calculated formula | C26 H32 Cu2 Hg2 N6 O2 |
Title of publication | Bis(4-pyridyl)mercury ‒ a new linear tecton in crystal engineering: coordination polymers and co-crystallization processes |
Authors of publication | Mocanu, Teodora; Raţ, Ciprian I.; Maxim, Catalin; Shova, Sergiu; Tudor, Violeta; Silvestru, Cristian; Andruh, Marius |
Journal of publication | CrystEngComm |
Year of publication | 2015 |
Journal volume | 17 |
Journal issue | 29 |
Pages of publication | 5474 |
a | 10.5149 ± 0.0011 Å |
b | 12.0894 ± 0.0012 Å |
c | 29.347 ± 0.003 Å |
α | 90° |
β | 92.74 ± 0.008° |
γ | 90° |
Cell volume | 3726.3 ± 0.7 Å3 |
Cell temperature | 293 ± 2 K |
Ambient diffraction temperature | 293 ± 2 K |
Number of distinct elements | 8 |
Space group number | 14 |
Hermann-Mauguin space group symbol | P 1 21/c 1 |
Hall space group symbol | -P 2ybc |
Residual factor for all reflections | 0.243 |
Residual factor for significantly intense reflections | 0.0564 |
Weighted residual factors for significantly intense reflections | 0.1156 |
Weighted residual factors for all reflections included in the refinement | 0.1723 |
Goodness-of-fit parameter for all reflections included in the refinement | 0.629 |
Diffraction radiation wavelength | 0.71073 Å |
Diffraction radiation type | MoKα |