Information card for entry 7220662
Formula | C22 H18 Hg N2 O2 |
Calculated formula | C22 H18 Hg N2 O2 |
Title of publication | Bis(4-pyridyl)mercury ‒ a new linear tecton in crystal engineering: coordination polymers and co-crystallization processes |
Authors of publication | Mocanu, Teodora; Raţ, Ciprian I.; Maxim, Catalin; Shova, Sergiu; Tudor, Violeta; Silvestru, Cristian; Andruh, Marius |
Journal of publication | CrystEngComm |
Year of publication | 2015 |
Journal volume | 17 |
Journal issue | 29 |
Pages of publication | 5474 |
a | 14.6075 ± 0.0013 Å |
b | 8.1508 ± 0.0012 Å |
c | 15.9817 ± 0.001 Å |
α | 90° |
β | 94.662 ± 0.007° |
γ | 90° |
Cell volume | 1896.5 ± 0.3 Å3 |
Cell temperature | 293 ± 2 K |
Ambient diffraction temperature | 293 ± 2 K |
Number of distinct elements | 5 |
Space group number | 14 |
Hermann-Mauguin space group symbol | P 1 21/c 1 |
Hall space group symbol | -P 2ybc |
Residual factor for all reflections | 0.1268 |
Residual factor for significantly intense reflections | 0.0593 |
Weighted residual factors for significantly intense reflections | 0.0889 |
Weighted residual factors for all reflections included in the refinement | 0.1134 |
Goodness-of-fit parameter for all reflections included in the refinement | 0.923 |
Diffraction radiation wavelength | 0.71073 Å |
Diffraction radiation type | MoKα |