Information card for entry 7220675
Formula | C33 H23 Fe2 N5 O10 |
Calculated formula | C33 H21 Fe2 N5 O10 |
Title of publication | Structural diversity of five coordination polymers based on 2,6-bis(3,5-dicarboxyphenyl)pyridine ligand: solvothermal syntheses, structural characterizations, and magnetic properties |
Authors of publication | Fan, Liming; Fan, Weiliu; Li, Bin; Liu, Xinzheng; Zhao, Xian; Zhang, Xiutang |
Journal of publication | CrystEngComm |
Year of publication | 2015 |
Journal volume | 17 |
Journal issue | 25 |
Pages of publication | 4669 |
a | 9.6476 ± 0.0006 Å |
b | 10.2117 ± 0.0007 Å |
c | 16.4488 ± 0.0011 Å |
α | 107.366 ± 0.001° |
β | 95.221 ± 0.001° |
γ | 99.914 ± 0.001° |
Cell volume | 1505.97 ± 0.17 Å3 |
Cell temperature | 296 ± 2 K |
Ambient diffraction temperature | 296.15 K |
Number of distinct elements | 5 |
Space group number | 2 |
Hermann-Mauguin space group symbol | P -1 |
Hall space group symbol | -P 1 |
Residual factor for all reflections | 0.037 |
Residual factor for significantly intense reflections | 0.0331 |
Weighted residual factors for significantly intense reflections | 0.0931 |
Weighted residual factors for all reflections included in the refinement | 0.0959 |
Goodness-of-fit parameter for all reflections included in the refinement | 1.043 |
Diffraction radiation wavelength | 0.71073 Å |
Diffraction radiation type | MoKα |