Information card for entry 7220676
Formula | C33 H21 Cu N5 O10 |
Calculated formula | C33 H21 Cu N5 O10 |
Title of publication | Structural diversity of five coordination polymers based on 2,6-bis(3,5-dicarboxyphenyl)pyridine ligand: solvothermal syntheses, structural characterizations, and magnetic properties |
Authors of publication | Fan, Liming; Fan, Weiliu; Li, Bin; Liu, Xinzheng; Zhao, Xian; Zhang, Xiutang |
Journal of publication | CrystEngComm |
Year of publication | 2015 |
Journal volume | 17 |
Journal issue | 25 |
Pages of publication | 4669 |
a | 7.6476 ± 0.0005 Å |
b | 12.1053 ± 0.0007 Å |
c | 16.8248 ± 0.001 Å |
α | 90° |
β | 98.488 ± 0.002° |
γ | 90° |
Cell volume | 1540.52 ± 0.16 Å3 |
Cell temperature | 296 ± 2 K |
Ambient diffraction temperature | 296 ± 2 K |
Number of distinct elements | 5 |
Space group number | 13 |
Hermann-Mauguin space group symbol | P 1 2/n 1 |
Hall space group symbol | -P 2yac |
Residual factor for all reflections | 0.0911 |
Residual factor for significantly intense reflections | 0.0645 |
Weighted residual factors for significantly intense reflections | 0.1411 |
Weighted residual factors for all reflections included in the refinement | 0.1531 |
Goodness-of-fit parameter for all reflections included in the refinement | 1.108 |
Diffraction radiation wavelength | 0.71073 Å |
Diffraction radiation type | MoKα |