Information card for entry 7220679
Formula | C57 H47 Mn2 N13 O12 |
Calculated formula | C57 H47 Mn2 N13 O12 |
Title of publication | Structural diversity of five coordination polymers based on 2,6-bis(3,5-dicarboxyphenyl)pyridine ligand: solvothermal syntheses, structural characterizations, and magnetic properties |
Authors of publication | Fan, Liming; Fan, Weiliu; Li, Bin; Liu, Xinzheng; Zhao, Xian; Zhang, Xiutang |
Journal of publication | CrystEngComm |
Year of publication | 2015 |
Journal volume | 17 |
Journal issue | 25 |
Pages of publication | 4669 |
a | 17.6549 ± 0.0009 Å |
b | 16.6017 ± 0.0007 Å |
c | 19.0614 ± 0.0009 Å |
α | 90° |
β | 112.771 ± 0.002° |
γ | 90° |
Cell volume | 5151.5 ± 0.4 Å3 |
Cell temperature | 296 ± 2 K |
Ambient diffraction temperature | 296.15 K |
Number of distinct elements | 5 |
Space group number | 15 |
Hermann-Mauguin space group symbol | C 1 2/c 1 |
Hall space group symbol | -C 2yc |
Residual factor for all reflections | 0.0457 |
Residual factor for significantly intense reflections | 0.0367 |
Weighted residual factors for significantly intense reflections | 0.0859 |
Weighted residual factors for all reflections included in the refinement | 0.091 |
Goodness-of-fit parameter for all reflections included in the refinement | 1.045 |
Diffraction radiation wavelength | 0.71073 Å |
Diffraction radiation type | MoKα |