Information card for entry 7220678
Formula | C45 H31 Co2 N9 O9 |
Calculated formula | C45 H31 Co2 N9 O9 |
Title of publication | Structural diversity of five coordination polymers based on 2,6-bis(3,5-dicarboxyphenyl)pyridine ligand: solvothermal syntheses, structural characterizations, and magnetic properties |
Authors of publication | Fan, Liming; Fan, Weiliu; Li, Bin; Liu, Xinzheng; Zhao, Xian; Zhang, Xiutang |
Journal of publication | CrystEngComm |
Year of publication | 2015 |
Journal volume | 17 |
Journal issue | 25 |
Pages of publication | 4669 |
a | 10.898 ± 0.002 Å |
b | 12.605 ± 0.003 Å |
c | 28.807 ± 0.006 Å |
α | 90° |
β | 96.326 ± 0.004° |
γ | 90° |
Cell volume | 3933.1 ± 1.4 Å3 |
Cell temperature | 296 ± 2 K |
Ambient diffraction temperature | 296.15 K |
Number of distinct elements | 5 |
Space group number | 14 |
Hermann-Mauguin space group symbol | P 1 21/n 1 |
Hall space group symbol | -P 2yn |
Residual factor for all reflections | 0.0628 |
Residual factor for significantly intense reflections | 0.0412 |
Weighted residual factors for significantly intense reflections | 0.104 |
Weighted residual factors for all reflections included in the refinement | 0.1243 |
Goodness-of-fit parameter for all reflections included in the refinement | 1.084 |
Diffraction radiation wavelength | 0.71073 Å |
Diffraction radiation type | MoKα |