Information card for entry 7220727
Formula | C21 H17 Cd N3 O8 S2 |
Calculated formula | C21 H17 Cd N3 O8 S2 |
Title of publication | Syntheses, structures, and properties of nine d10or p-block coordination polymers based on a ligand containing both terpyridyl and sulfo groups |
Authors of publication | Zhang, Li; Zheng, Jia-Dan; Chen, Yi-Ting; Zheng, Sheng-Run; Fan, Jun; Zhang, Wei-Guang |
Journal of publication | CrystEngComm |
Year of publication | 2015 |
Journal volume | 17 |
Journal issue | 29 |
Pages of publication | 5538 |
a | 8.2928 ± 0.0016 Å |
b | 11.423 ± 0.002 Å |
c | 12.436 ± 0.002 Å |
α | 101.262 ± 0.002° |
β | 103.547 ± 0.002° |
γ | 96.798 ± 0.002° |
Cell volume | 1106.5 ± 0.3 Å3 |
Cell temperature | 298 ± 2 K |
Ambient diffraction temperature | 298 ± 2 K |
Number of distinct elements | 6 |
Space group number | 2 |
Hermann-Mauguin space group symbol | P -1 |
Hall space group symbol | -P 1 |
Residual factor for all reflections | 0.0436 |
Residual factor for significantly intense reflections | 0.0364 |
Weighted residual factors for significantly intense reflections | 0.0837 |
Weighted residual factors for all reflections included in the refinement | 0.0883 |
Goodness-of-fit parameter for all reflections included in the refinement | 1.067 |
Diffraction radiation wavelength | 0.71073 Å |
Diffraction radiation type | MoKα |