Information card for entry 7220728
Formula | C21 H73 Ag N3 O36 S2 |
Calculated formula | C21 H13 Ag N3 O9 S2 |
Title of publication | Syntheses, structures, and properties of nine d10or p-block coordination polymers based on a ligand containing both terpyridyl and sulfo groups |
Authors of publication | Zhang, Li; Zheng, Jia-Dan; Chen, Yi-Ting; Zheng, Sheng-Run; Fan, Jun; Zhang, Wei-Guang |
Journal of publication | CrystEngComm |
Year of publication | 2015 |
Journal volume | 17 |
Journal issue | 29 |
Pages of publication | 5538 |
a | 36.038 ± 0.012 Å |
b | 19.963 ± 0.007 Å |
c | 8.853 ± 0.003 Å |
α | 90° |
β | 95.622 ± 0.006° |
γ | 90° |
Cell volume | 6338 ± 4 Å3 |
Cell temperature | 293 ± 2 K |
Ambient diffraction temperature | 293 ± 2 K |
Number of distinct elements | 6 |
Space group number | 15 |
Hermann-Mauguin space group symbol | C 1 2/c 1 |
Hall space group symbol | -C 2yc |
Residual factor for all reflections | 0.2738 |
Residual factor for significantly intense reflections | 0.1036 |
Weighted residual factors for significantly intense reflections | 0.2613 |
Weighted residual factors for all reflections included in the refinement | 0.3455 |
Goodness-of-fit parameter for all reflections included in the refinement | 1.086 |
Diffraction radiation wavelength | 0.71073 Å |
Diffraction radiation type | MoKα |