Information card for entry 7220810
Formula | C18 H26 Eu2 N8 O18 |
Calculated formula | C18 H26 Eu2 N8 O18 |
Title of publication | Lanthanide coordination polymers constructed from 5-(1H-tetrazol-5-yl)isophthalic acid ligand: white light emission and color tuning |
Authors of publication | Jia, Jia; Xu, Jianing; Wang, Shengyan; Wang, Pengcheng; Gao, Lijuan; Yu, Miao; Fan, Yong; Wang, Li |
Journal of publication | CrystEngComm |
Year of publication | 2015 |
Journal volume | 17 |
Journal issue | 31 |
Pages of publication | 6030 |
a | 7.9812 ± 0.0003 Å |
b | 9.7491 ± 0.0004 Å |
c | 10.4153 ± 0.0004 Å |
α | 116.803 ± 0.001° |
β | 107.37 ± 0.001° |
γ | 95.67 ± 0.001° |
Cell volume | 663.93 ± 0.05 Å3 |
Cell temperature | 296 ± 2 K |
Ambient diffraction temperature | 296 ± 2 K |
Number of distinct elements | 5 |
Space group number | 2 |
Hermann-Mauguin space group symbol | P -1 |
Hall space group symbol | -P 1 |
Residual factor for all reflections | 0.0225 |
Residual factor for significantly intense reflections | 0.021 |
Weighted residual factors for significantly intense reflections | 0.0514 |
Weighted residual factors for all reflections included in the refinement | 0.0519 |
Goodness-of-fit parameter for all reflections included in the refinement | 1.013 |
Diffraction radiation wavelength | 0.71073 Å |
Diffraction radiation type | MoKα |