Information card for entry 7220811
Formula | C9 H13 N4 O9 Sm |
Calculated formula | C9 H13 N4 O9 Sm |
Title of publication | Lanthanide coordination polymers constructed from 5-(1H-tetrazol-5-yl)isophthalic acid ligand: white light emission and color tuning |
Authors of publication | Jia, Jia; Xu, Jianing; Wang, Shengyan; Wang, Pengcheng; Gao, Lijuan; Yu, Miao; Fan, Yong; Wang, Li |
Journal of publication | CrystEngComm |
Year of publication | 2015 |
Journal volume | 17 |
Journal issue | 31 |
Pages of publication | 6030 |
a | 7.9849 ± 0.0016 Å |
b | 9.783 ± 0.002 Å |
c | 10.443 ± 0.002 Å |
α | 116.75 ± 0.03° |
β | 107.36 ± 0.03° |
γ | 95.71 ± 0.03° |
Cell volume | 668.6 ± 0.4 Å3 |
Cell temperature | 293 ± 2 K |
Ambient diffraction temperature | 293 ± 2 K |
Number of distinct elements | 5 |
Space group number | 2 |
Hermann-Mauguin space group symbol | P -1 |
Hall space group symbol | -P 1 |
Residual factor for all reflections | 0.0365 |
Residual factor for significantly intense reflections | 0.0341 |
Weighted residual factors for significantly intense reflections | 0.0768 |
Weighted residual factors for all reflections included in the refinement | 0.0774 |
Goodness-of-fit parameter for all reflections included in the refinement | 1.572 |
Diffraction radiation wavelength | 0.71073 Å |
Diffraction radiation type | MoKα |