Information card for entry 7220814
Formula | C6 H7 Cd2 N13 O |
Calculated formula | C6 H7 Cd2 N13 O |
Title of publication | Zinc and cadmium metal-directed coordination polymers: in situ flexible tetrazole ligand synthesis, structures, and properties |
Authors of publication | Dong, Ruo Ting; Ma, Zhao Ying; Chen, Li Xin; Huang, Lan Fen; Li, Qian Hong; Hu, Ming Yuan; Shen, Mo Yuan; Li, Chu Wen; Deng, Hong |
Journal of publication | CrystEngComm |
Year of publication | 2015 |
Journal volume | 17 |
Journal issue | 30 |
Pages of publication | 5814 |
a | 9.8747 ± 0.0008 Å |
b | 6.7895 ± 0.0006 Å |
c | 17.9044 ± 0.0015 Å |
α | 90° |
β | 101.958 ± 0.001° |
γ | 90° |
Cell volume | 1174.34 ± 0.17 Å3 |
Cell temperature | 296 ± 2 K |
Ambient diffraction temperature | 296 ± 2 K |
Number of distinct elements | 5 |
Space group number | 14 |
Hermann-Mauguin space group symbol | P 1 21/n 1 |
Hall space group symbol | -P 2yn |
Residual factor for all reflections | 0.063 |
Residual factor for significantly intense reflections | 0.0488 |
Weighted residual factors for significantly intense reflections | 0.1028 |
Weighted residual factors for all reflections included in the refinement | 0.1183 |
Goodness-of-fit parameter for all reflections included in the refinement | 1.105 |
Diffraction radiation wavelength | 0.71073 Å |
Diffraction radiation type | MoKα |