Information card for entry 7220813
Formula | C4 H5 Cd N9 O |
Calculated formula | C4 H5 Cd N9 O |
Title of publication | Zinc and cadmium metal-directed coordination polymers: in situ flexible tetrazole ligand synthesis, structures, and properties |
Authors of publication | Dong, Ruo Ting; Ma, Zhao Ying; Chen, Li Xin; Huang, Lan Fen; Li, Qian Hong; Hu, Ming Yuan; Shen, Mo Yuan; Li, Chu Wen; Deng, Hong |
Journal of publication | CrystEngComm |
Year of publication | 2015 |
Journal volume | 17 |
Journal issue | 30 |
Pages of publication | 5814 |
a | 20.8197 ± 0.0013 Å |
b | 20.8197 ± 0.0013 Å |
c | 11.5581 ± 0.0015 Å |
α | 90° |
β | 90° |
γ | 120° |
Cell volume | 4338.8 ± 0.7 Å3 |
Cell temperature | 296 ± 2 K |
Ambient diffraction temperature | 296 ± 2 K |
Number of distinct elements | 5 |
Space group number | 148 |
Hermann-Mauguin space group symbol | R -3 :H |
Hall space group symbol | -R 3 |
Residual factor for all reflections | 0.0257 |
Residual factor for significantly intense reflections | 0.0247 |
Weighted residual factors for significantly intense reflections | 0.0782 |
Weighted residual factors for all reflections included in the refinement | 0.0789 |
Goodness-of-fit parameter for all reflections included in the refinement | 1.165 |
Diffraction radiation wavelength | 0.71073 Å |
Diffraction radiation type | MoKα |