Information card for entry 7220818
Formula | C18 H23.65 Cd9 N30 O21.83 |
Calculated formula | C18 H23.656 Cd9 N30 O21.828 |
Title of publication | Zinc and cadmium metal-directed coordination polymers: in situ flexible tetrazole ligand synthesis, structures, and properties |
Authors of publication | Dong, Ruo Ting; Ma, Zhao Ying; Chen, Li Xin; Huang, Lan Fen; Li, Qian Hong; Hu, Ming Yuan; Shen, Mo Yuan; Li, Chu Wen; Deng, Hong |
Journal of publication | CrystEngComm |
Year of publication | 2015 |
Journal volume | 17 |
Journal issue | 30 |
Pages of publication | 5814 |
a | 7.3781 ± 0.0013 Å |
b | 13.574 ± 0.002 Å |
c | 13.578 ± 0.002 Å |
α | 113.181 ± 0.002° |
β | 103.841 ± 0.002° |
γ | 90.952 ± 0.002° |
Cell volume | 1204.4 ± 0.3 Å3 |
Cell temperature | 296 ± 2 K |
Ambient diffraction temperature | 296 ± 2 K |
Number of distinct elements | 5 |
Space group number | 2 |
Hermann-Mauguin space group symbol | P -1 |
Hall space group symbol | -P 1 |
Residual factor for all reflections | 0.0467 |
Residual factor for significantly intense reflections | 0.0346 |
Weighted residual factors for significantly intense reflections | 0.0764 |
Weighted residual factors for all reflections included in the refinement | 0.0844 |
Goodness-of-fit parameter for all reflections included in the refinement | 1.035 |
Diffraction radiation wavelength | 0.71073 Å |
Diffraction radiation type | MoKα |