Information card for entry 7220819
Formula | C8 H9 N5 O3 Zn |
Calculated formula | C8 H9 N5 O3 Zn |
Title of publication | Zinc and cadmium metal-directed coordination polymers: in situ flexible tetrazole ligand synthesis, structures, and properties |
Authors of publication | Dong, Ruo Ting; Ma, Zhao Ying; Chen, Li Xin; Huang, Lan Fen; Li, Qian Hong; Hu, Ming Yuan; Shen, Mo Yuan; Li, Chu Wen; Deng, Hong |
Journal of publication | CrystEngComm |
Year of publication | 2015 |
Journal volume | 17 |
Journal issue | 30 |
Pages of publication | 5814 |
a | 16.852 ± 0.002 Å |
b | 17.116 ± 0.002 Å |
c | 9.7103 ± 0.0014 Å |
α | 90° |
β | 118.683 ± 0.002° |
γ | 90° |
Cell volume | 2457.1 ± 0.5 Å3 |
Cell temperature | 296 ± 2 K |
Ambient diffraction temperature | 296 ± 2 K |
Number of distinct elements | 5 |
Space group number | 15 |
Hermann-Mauguin space group symbol | C 1 2/c 1 |
Hall space group symbol | -C 2yc |
Residual factor for all reflections | 0.0506 |
Residual factor for significantly intense reflections | 0.0453 |
Weighted residual factors for significantly intense reflections | 0.1552 |
Weighted residual factors for all reflections included in the refinement | 0.1601 |
Goodness-of-fit parameter for all reflections included in the refinement | 1.088 |
Diffraction radiation wavelength | 0.71073 Å |
Diffraction radiation type | MoKα |