Information card for entry 7220821
Formula | C10 H10 N O5 Zn |
Calculated formula | C10 H10 N O5 Zn |
Title of publication | Study of temperature and ligand flexibility effects on coordination polymer formation from cyclobutanetetracarboxylic acid |
Authors of publication | Bello, Lizaira; Quintero, Marilyn; Mora, Asiloé J.; González, Teresa; Escalona, Ana; Añez, Rafael; Ávila, Edward E.; Briceño, Alexander |
Journal of publication | CrystEngComm |
Year of publication | 2015 |
Journal volume | 17 |
Journal issue | 31 |
Pages of publication | 5921 |
a | 5.8438 ± 0.0013 Å |
b | 12.088 ± 0.003 Å |
c | 15.288 ± 0.003 Å |
α | 90° |
β | 99.975 ± 0.005° |
γ | 90° |
Cell volume | 1063.6 ± 0.4 Å3 |
Cell temperature | 293 ± 2 K |
Ambient diffraction temperature | 293 ± 2 K |
Number of distinct elements | 5 |
Space group number | 13 |
Hermann-Mauguin space group symbol | P 1 2/c 1 |
Hall space group symbol | -P 2yc |
Residual factor for all reflections | 0.0482 |
Residual factor for significantly intense reflections | 0.0363 |
Weighted residual factors for significantly intense reflections | 0.0837 |
Weighted residual factors for all reflections included in the refinement | 0.0922 |
Goodness-of-fit parameter for all reflections included in the refinement | 1.103 |
Diffraction radiation wavelength | 0.7107 Å |
Diffraction radiation type | MoKα |