Information card for entry 7220820
Formula | C20 H22 N2 O11 Zn2 |
Calculated formula | C20 H22 N2 O11 Zn2 |
Title of publication | Study of temperature and ligand flexibility effects on coordination polymer formation from cyclobutanetetracarboxylic acid |
Authors of publication | Bello, Lizaira; Quintero, Marilyn; Mora, Asiloé J.; González, Teresa; Escalona, Ana; Añez, Rafael; Ávila, Edward E.; Briceño, Alexander |
Journal of publication | CrystEngComm |
Year of publication | 2015 |
Journal volume | 17 |
Journal issue | 31 |
Pages of publication | 5921 |
a | 15.023 ± 0.002 Å |
b | 10.1643 ± 0.0013 Å |
c | 18.196 ± 0.003 Å |
α | 90° |
β | 114.233 ± 0.002° |
γ | 90° |
Cell volume | 2533.7 ± 0.6 Å3 |
Cell temperature | 293 ± 2 K |
Ambient diffraction temperature | 293 ± 2 K |
Number of distinct elements | 5 |
Space group number | 14 |
Hermann-Mauguin space group symbol | P 1 21/c 1 |
Hall space group symbol | -P 2ybc |
Residual factor for all reflections | 0.0403 |
Residual factor for significantly intense reflections | 0.0319 |
Weighted residual factors for significantly intense reflections | 0.0731 |
Weighted residual factors for all reflections included in the refinement | 0.0788 |
Goodness-of-fit parameter for all reflections included in the refinement | 1.048 |
Diffraction radiation wavelength | 0.7107 Å |
Diffraction radiation type | MoKα |