Information card for entry 7220910
Chemical name | L |
Formula | C28 H22 N6 |
Calculated formula | C28 H22.005 N6 |
Title of publication | Discrete and polymeric complexes of a macrocyclic pillar ligand in the absence and presence of dicarboxylic acid coligands |
Authors of publication | Ryu, Hyunsoo; Mulyana, Yanyan; Park, In-Hyeok; Kim, Jinhee; Lindoy, Leonard F.; Lee, Shim Sung |
Journal of publication | CrystEngComm |
Year of publication | 2015 |
Journal volume | 17 |
Journal issue | 30 |
Pages of publication | 5717 |
a | 9.4974 ± 0.0009 Å |
b | 17.4158 ± 0.0016 Å |
c | 25.769 ± 0.002 Å |
α | 80.532 ± 0.005° |
β | 84.709 ± 0.004° |
γ | 89.933 ± 0.004° |
Cell volume | 4185.9 ± 0.6 Å3 |
Cell temperature | 173 ± 2 K |
Ambient diffraction temperature | 173 ± 2 K |
Number of distinct elements | 3 |
Space group number | 2 |
Hermann-Mauguin space group symbol | P -1 |
Hall space group symbol | -P 1 |
Residual factor for all reflections | 0.1799 |
Residual factor for significantly intense reflections | 0.1044 |
Weighted residual factors for significantly intense reflections | 0.2681 |
Weighted residual factors for all reflections included in the refinement | 0.3286 |
Goodness-of-fit parameter for all reflections included in the refinement | 1.024 |
Diffraction radiation wavelength | 0.71073 Å |
Diffraction radiation type | MoKα |