Information card for entry 7220911
Chemical name | 1 |
Formula | C56 H43 N12 Ni |
Calculated formula | C56 H43 N12 Ni |
Title of publication | Discrete and polymeric complexes of a macrocyclic pillar ligand in the absence and presence of dicarboxylic acid coligands |
Authors of publication | Ryu, Hyunsoo; Mulyana, Yanyan; Park, In-Hyeok; Kim, Jinhee; Lindoy, Leonard F.; Lee, Shim Sung |
Journal of publication | CrystEngComm |
Year of publication | 2015 |
Journal volume | 17 |
Journal issue | 30 |
Pages of publication | 5717 |
a | 51.246 ± 0.003 Å |
b | 4.7708 ± 0.0002 Å |
c | 17.4723 ± 0.0008 Å |
α | 90° |
β | 99.207 ± 0.003° |
γ | 90° |
Cell volume | 4216.7 ± 0.4 Å3 |
Cell temperature | 173 ± 2 K |
Ambient diffraction temperature | 173 ± 2 K |
Number of distinct elements | 4 |
Space group number | 15 |
Hermann-Mauguin space group symbol | C 1 2/c 1 |
Hall space group symbol | -C 2yc |
Residual factor for all reflections | 0.1468 |
Residual factor for significantly intense reflections | 0.0924 |
Weighted residual factors for significantly intense reflections | 0.2334 |
Weighted residual factors for all reflections included in the refinement | 0.2703 |
Goodness-of-fit parameter for all reflections included in the refinement | 1.076 |
Diffraction radiation wavelength | 0.71073 Å |
Diffraction radiation type | MoKα |