Information card for entry 7220962
Formula | C24 H34 N6 O10 Zn2 |
Calculated formula | C24 H34 N6 O10 Zn2 |
Title of publication | A self-catenated rob-type porous coordination polymer constructed from triazolate and carboxylate ligands: fluorescence response to the reversible phase transformation |
Authors of publication | Deng, Mingli; Tai, Shijun; Zhang, Weiquan; Wang, Yongchen; Zhu, Jiaxing; Zhang, Jinsheng; Ling, Yun; Zhou, Yaming |
Journal of publication | CrystEngComm |
Year of publication | 2015 |
Journal volume | 17 |
Journal issue | 31 |
Pages of publication | 6023 |
a | 39.356 ± 0.013 Å |
b | 9.332 ± 0.003 Å |
c | 9.842 ± 0.003 Å |
α | 90° |
β | 101.864 ± 0.004° |
γ | 90° |
Cell volume | 3537 ± 2 Å3 |
Cell temperature | 293 ± 2 K |
Ambient diffraction temperature | 293 ± 2 K |
Number of distinct elements | 5 |
Space group number | 15 |
Hermann-Mauguin space group symbol | C 1 2/c 1 |
Hall space group symbol | -C 2yc |
Residual factor for all reflections | 0.0604 |
Residual factor for significantly intense reflections | 0.0554 |
Weighted residual factors for significantly intense reflections | 0.1687 |
Weighted residual factors for all reflections included in the refinement | 0.1747 |
Goodness-of-fit parameter for all reflections included in the refinement | 1.096 |
Diffraction radiation wavelength | 0.71073 Å |
Diffraction radiation type | MoKα |