Information card for entry 7220963
Formula | C22 H28 N8 O8 Zn2 |
Calculated formula | C22 H20 N8 O7.9998 Zn2 |
Title of publication | A self-catenated rob-type porous coordination polymer constructed from triazolate and carboxylate ligands: fluorescence response to the reversible phase transformation |
Authors of publication | Deng, Mingli; Tai, Shijun; Zhang, Weiquan; Wang, Yongchen; Zhu, Jiaxing; Zhang, Jinsheng; Ling, Yun; Zhou, Yaming |
Journal of publication | CrystEngComm |
Year of publication | 2015 |
Journal volume | 17 |
Journal issue | 31 |
Pages of publication | 6023 |
a | 38.503 ± 0.005 Å |
b | 9.4511 ± 0.0012 Å |
c | 9.8023 ± 0.0013 Å |
α | 90° |
β | 100.578 ± 0.002° |
γ | 90° |
Cell volume | 3506.4 ± 0.8 Å3 |
Cell temperature | 293 ± 2 K |
Ambient diffraction temperature | 293 ± 2 K |
Number of distinct elements | 5 |
Space group number | 15 |
Hermann-Mauguin space group symbol | C 1 2/c 1 |
Hall space group symbol | -C 2yc |
Residual factor for all reflections | 0.0952 |
Residual factor for significantly intense reflections | 0.0618 |
Weighted residual factors for significantly intense reflections | 0.2065 |
Weighted residual factors for all reflections included in the refinement | 0.2442 |
Goodness-of-fit parameter for all reflections included in the refinement | 1.122 |
Diffraction radiation wavelength | 0.71073 Å |
Diffraction radiation type | MoKα |