Information card for entry 7221631
Formula | C10 H26.67 Cu N4 O7.33 V2 |
Calculated formula | C10 H24 Cu N4 O7.33333 V2 |
Title of publication | Sequential single-crystal-to-single-crystal transformations promoted by gradual thermal dehydration in a porous metavanadate hybrid |
Authors of publication | Martín-Caballero, Jagoba; Wéry, Ana San José; Artetxe, Beñat; Reinoso, Santiago; Felices, Leire San; Vilas, José Luis; Gutiérrez-Zorrilla, Juan M. |
Journal of publication | CrystEngComm |
Year of publication | 2015 |
Journal volume | 17 |
Journal issue | 46 |
Pages of publication | 8915 |
a | 8.6253 ± 0.001 Å |
b | 12.89 ± 0.002 Å |
c | 13.368 ± 0.002 Å |
α | 103.208 ± 0.014° |
β | 106.557 ± 0.012° |
γ | 95.595 ± 0.011° |
Cell volume | 1365.7 ± 0.4 Å3 |
Cell temperature | 100 ± 2 K |
Ambient diffraction temperature | 100 ± 2 K |
Number of distinct elements | 6 |
Space group number | 2 |
Hermann-Mauguin space group symbol | P -1 |
Hall space group symbol | -P 1 |
Residual factor for all reflections | 0.1338 |
Residual factor for significantly intense reflections | 0.0886 |
Weighted residual factors for significantly intense reflections | 0.1621 |
Weighted residual factors for all reflections included in the refinement | 0.1828 |
Goodness-of-fit parameter for all reflections included in the refinement | 1.132 |
Diffraction radiation probe | x-ray |
Diffraction radiation wavelength | 0.71073 Å |
Diffraction radiation type | MoKα |