Information card for entry 7221632
Formula | C10 H24 Cu N4 O6 V2 |
Calculated formula | C10 H24 Cu N4 O6 V2 |
Title of publication | Sequential single-crystal-to-single-crystal transformations promoted by gradual thermal dehydration in a porous metavanadate hybrid |
Authors of publication | Martín-Caballero, Jagoba; Wéry, Ana San José; Artetxe, Beñat; Reinoso, Santiago; Felices, Leire San; Vilas, José Luis; Gutiérrez-Zorrilla, Juan M. |
Journal of publication | CrystEngComm |
Year of publication | 2015 |
Journal volume | 17 |
Journal issue | 46 |
Pages of publication | 8915 |
a | 8.751 ± 0.002 Å |
b | 13.094 ± 0.003 Å |
c | 13.363 ± 0.003 Å |
α | 102.449 ± 0.018° |
β | 101.653 ± 0.019° |
γ | 101.148 ± 0.019° |
Cell volume | 1418.8 ± 0.6 Å3 |
Cell temperature | 393 ± 2 K |
Ambient diffraction temperature | 393 ± 2 K |
Number of distinct elements | 6 |
Space group number | 2 |
Hermann-Mauguin space group symbol | P -1 |
Hall space group symbol | -P 1 |
Residual factor for all reflections | 0.2426 |
Residual factor for significantly intense reflections | 0.1078 |
Weighted residual factors for significantly intense reflections | 0.1866 |
Weighted residual factors for all reflections included in the refinement | 0.2511 |
Goodness-of-fit parameter for all reflections included in the refinement | 1.058 |
Diffraction radiation probe | x-ray |
Diffraction radiation wavelength | 0.71073 Å |
Diffraction radiation type | MoKα |