Information card for entry 7221642
Formula | C17 H11 N5 O2 Zn |
Calculated formula | C17 H11 N5 O2 Zn |
Title of publication | Solvent modulated assembly of two Zn metal‒organic frameworks: syntheses, luminescence, and gas adsorption properties |
Authors of publication | Zhang, Liangliang; Zhang, Yu; Wang, Rongming; Kang, Zixi; Liu, Xiaobin; Sun, Daofeng; Meng, Qingguo |
Journal of publication | CrystEngComm |
Year of publication | 2015 |
Journal volume | 17 |
Journal issue | 34 |
Pages of publication | 6591 |
a | 17.4695 ± 0.0003 Å |
b | 8.64315 ± 0.00013 Å |
c | 19.7657 ± 0.0003 Å |
α | 90° |
β | 90° |
γ | 90° |
Cell volume | 2984.45 ± 0.08 Å3 |
Cell temperature | 293 ± 2 K |
Ambient diffraction temperature | 293 ± 2 K |
Number of distinct elements | 5 |
Space group number | 61 |
Hermann-Mauguin space group symbol | P b c a |
Hall space group symbol | -P 2ac 2ab |
Residual factor for all reflections | 0.026 |
Residual factor for significantly intense reflections | 0.0237 |
Weighted residual factors for significantly intense reflections | 0.0638 |
Weighted residual factors for all reflections included in the refinement | 0.0653 |
Goodness-of-fit parameter for all reflections included in the refinement | 1.053 |
Diffraction radiation wavelength | 1.5418 Å |
Diffraction radiation type | CuKα |