Information card for entry 7221643
Formula |
C28 H25 N9 O6 Zn2 |
Calculated formula |
C28 H25 N9 O6 Zn2 |
Title of publication |
Solvent modulated assembly of two Zn metal‒organic frameworks: syntheses, luminescence, and gas adsorption properties |
Authors of publication |
Zhang, Liangliang; Zhang, Yu; Wang, Rongming; Kang, Zixi; Liu, Xiaobin; Sun, Daofeng; Meng, Qingguo |
Journal of publication |
CrystEngComm |
Year of publication |
2015 |
Journal volume |
17 |
Journal issue |
34 |
Pages of publication |
6591 |
a |
18.58 ± 0.004 Å |
b |
9.962 ± 0.002 Å |
c |
32.732 ± 0.008 Å |
α |
90° |
β |
90° |
γ |
90° |
Cell volume |
6058 ± 2 Å3 |
Cell temperature |
293 ± 2 K |
Ambient diffraction temperature |
293 ± 2 K |
Number of distinct elements |
5 |
Space group number |
61 |
Hermann-Mauguin space group symbol |
P b c a |
Hall space group symbol |
-P 2ac 2ab |
Residual factor for all reflections |
0.0408 |
Residual factor for significantly intense reflections |
0.0342 |
Weighted residual factors for significantly intense reflections |
0.0853 |
Weighted residual factors for all reflections included in the refinement |
0.0881 |
Goodness-of-fit parameter for all reflections included in the refinement |
1.114 |
Diffraction radiation wavelength |
0.71073 Å |
Diffraction radiation type |
MoKα |
Yes |
No |
No |