Information card for entry 7221644
Formula | C91 H199 Co3 N13 O71 |
Calculated formula | C64 H50 Co3 N4 O19 |
Title of publication | A highly stable porous multifunctional Co(ii) metal‒organic framework showing excellent gas storage applications and interesting magnetic properties |
Authors of publication | Li, Jian-Ping; Ma, Yu-Qin; Geng, Li-Hua; Li, Yun-Hui; Yi, Fei-Yan |
Journal of publication | CrystEngComm |
Year of publication | 2015 |
Journal volume | 17 |
Journal issue | 34 |
Pages of publication | 6471 |
a | 30.19 ± 0.005 Å |
b | 19.637 ± 0.003 Å |
c | 16.038 ± 0.003 Å |
α | 90° |
β | 108.829 ± 0.003° |
γ | 90° |
Cell volume | 8999 ± 3 Å3 |
Cell temperature | 273 ± 2 K |
Ambient diffraction temperature | 273 ± 2 K |
Number of distinct elements | 5 |
Space group number | 15 |
Hermann-Mauguin space group symbol | C 1 2/c 1 |
Hall space group symbol | -C 2yc |
Residual factor for all reflections | 0.1405 |
Residual factor for significantly intense reflections | 0.0896 |
Weighted residual factors for significantly intense reflections | 0.2452 |
Weighted residual factors for all reflections included in the refinement | 0.2841 |
Goodness-of-fit parameter for all reflections included in the refinement | 0.96 |
Diffraction radiation wavelength | 0.71073 Å |
Diffraction radiation type | MoKα |