Information card for entry 7221680
Formula | C60 H68 Cl6 N16 O21 |
Calculated formula | C60 H66 Cl6 N16 O21 |
Title of publication | Supramolecular open-framework architectures based on dicarboxylate H-bond acceptors and polytopic cations with three/four N‒H+donor units |
Authors of publication | Mouchaham, Georges; Gualino, Marion; Roques, Nans; Duhayon, Carine; Brandès, Stéphane; Sutter, Jean-Pascal |
Journal of publication | CrystEngComm |
Year of publication | 2015 |
Journal volume | 17 |
Journal issue | 46 |
Pages of publication | 8906 |
a | 9.2264 ± 0.0007 Å |
b | 31.583 ± 0.003 Å |
c | 13.1257 ± 0.001 Å |
α | 90° |
β | 105.764 ± 0.003° |
γ | 90° |
Cell volume | 3680.9 ± 0.5 Å3 |
Cell temperature | 100 K |
Ambient diffraction temperature | 100 K |
Number of distinct elements | 5 |
Space group number | 14 |
Hermann-Mauguin space group symbol | P 1 21/c 1 |
Hall space group symbol | -P 2ybc |
Residual factor for all reflections | 0.084 |
Residual factor for significantly intense reflections | 0.0798 |
Weighted residual factors for all reflections | 0.0815 |
Weighted residual factors for significantly intense reflections | 0.0747 |
Weighted residual factors for all reflections included in the refinement | 0.0721 |
Goodness-of-fit parameter for all reflections included in the refinement | 1.0484 |
Diffraction radiation wavelength | 0.71073 Å |
Diffraction radiation type | MoKα |