Information card for entry 7221681
Formula | C46 H49 Cl4 N7 O15 |
Calculated formula | C46 H49 Cl4 N7 O15 |
Title of publication | Supramolecular open-framework architectures based on dicarboxylate H-bond acceptors and polytopic cations with three/four N‒H+donor units |
Authors of publication | Mouchaham, Georges; Gualino, Marion; Roques, Nans; Duhayon, Carine; Brandès, Stéphane; Sutter, Jean-Pascal |
Journal of publication | CrystEngComm |
Year of publication | 2015 |
Journal volume | 17 |
Journal issue | 46 |
Pages of publication | 8906 |
a | 10.7229 ± 0.0001 Å |
b | 34.3062 ± 0.0004 Å |
c | 15.2099 ± 0.0002 Å |
α | 90° |
β | 114.8 ± 0.001° |
γ | 90° |
Cell volume | 5079.15 ± 0.11 Å3 |
Cell temperature | 180 K |
Ambient diffraction temperature | 180 K |
Number of distinct elements | 5 |
Space group number | 14 |
Hermann-Mauguin space group symbol | P 1 21/c 1 |
Hall space group symbol | -P 2ybc |
Residual factor for all reflections | 0.0747 |
Residual factor for significantly intense reflections | 0.0716 |
Weighted residual factors for all reflections | 0.0873 |
Weighted residual factors for significantly intense reflections | 0.0864 |
Weighted residual factors for all reflections included in the refinement | 0.0861 |
Goodness-of-fit parameter for all reflections included in the refinement | 0.9676 |
Diffraction radiation wavelength | 1.5418 Å |
Diffraction radiation type | CuKα |