Information card for entry 7221792
Formula | C26 H25 Cl0 Co N5 O13 |
Calculated formula | C26 H23 Co N5 O13 |
Title of publication | Polycarboxylate-directed various Co(ii) complexes based on a “V”-like bis-pyridyl-bis-amide derivative: construction, electrochemical and photocatalytic properties |
Authors of publication | Wang, Xiu-Li; Sha, Xiao-Ting; Liu, Guo-Cheng; Chen, Nai-Li; Tian, Yuan |
Journal of publication | CrystEngComm |
Year of publication | 2015 |
Journal volume | 17 |
Journal issue | 38 |
Pages of publication | 7290 |
a | 7.2427 ± 0.0004 Å |
b | 25.0077 ± 0.0014 Å |
c | 15.4019 ± 0.0008 Å |
α | 90° |
β | 99.477 ± 0.001° |
γ | 90° |
Cell volume | 2751.6 ± 0.3 Å3 |
Cell temperature | 296 ± 2 K |
Ambient diffraction temperature | 296 ± 2 K |
Number of distinct elements | 6 |
Space group number | 14 |
Hermann-Mauguin space group symbol | P 1 21/n 1 |
Hall space group symbol | -P 2yn |
Residual factor for all reflections | 0.0749 |
Residual factor for significantly intense reflections | 0.0559 |
Weighted residual factors for significantly intense reflections | 0.1495 |
Weighted residual factors for all reflections included in the refinement | 0.1631 |
Goodness-of-fit parameter for all reflections included in the refinement | 1 |
Diffraction radiation wavelength | 0.71073 Å |
Diffraction radiation type | MoKα |