Information card for entry 7221793
Formula | C26 H26 Cl0 Co N4 O11 |
Calculated formula | C26 H26 Co N4 O11 |
Title of publication | Polycarboxylate-directed various Co(ii) complexes based on a “V”-like bis-pyridyl-bis-amide derivative: construction, electrochemical and photocatalytic properties |
Authors of publication | Wang, Xiu-Li; Sha, Xiao-Ting; Liu, Guo-Cheng; Chen, Nai-Li; Tian, Yuan |
Journal of publication | CrystEngComm |
Year of publication | 2015 |
Journal volume | 17 |
Journal issue | 38 |
Pages of publication | 7290 |
a | 10.0924 ± 0.0006 Å |
b | 11.0595 ± 0.0007 Å |
c | 13.9619 ± 0.0008 Å |
α | 66.831 ± 0.001° |
β | 83.421 ± 0.001° |
γ | 71.279 ± 0.001° |
Cell volume | 1356.77 ± 0.14 Å3 |
Cell temperature | 296 ± 2 K |
Ambient diffraction temperature | 296 ± 2 K |
Number of distinct elements | 6 |
Space group number | 2 |
Hermann-Mauguin space group symbol | P -1 |
Hall space group symbol | -P 1 |
Residual factor for all reflections | 0.0615 |
Residual factor for significantly intense reflections | 0.0412 |
Weighted residual factors for significantly intense reflections | 0.0976 |
Weighted residual factors for all reflections included in the refinement | 0.1072 |
Goodness-of-fit parameter for all reflections included in the refinement | 1 |
Diffraction radiation wavelength | 0.71073 Å |
Diffraction radiation type | MoKα |