Information card for entry 7221797
Formula | C52 H52 N8 O44 Si W12 |
Calculated formula | C52 H52 N8 O44 Si W12 |
Title of publication | Polyanionic clusters embedded in lattice-type hydrogen bonding networks involving in situ bond activation and coupling of organic cations |
Authors of publication | Han, Zhan-Gang; Liu, Yun-Ping; Zhao, Xiao-Fang; Yan, Jin-Shuang; Zhai, Xue-Liang |
Journal of publication | CrystEngComm |
Year of publication | 2015 |
Journal volume | 17 |
Journal issue | 38 |
Pages of publication | 7339 |
a | 14.5284 ± 0.0019 Å |
b | 15.754 ± 0.002 Å |
c | 16.91 ± 0.002 Å |
α | 90° |
β | 93.141 ± 0.002° |
γ | 90° |
Cell volume | 3864.6 ± 0.8 Å3 |
Cell temperature | 296 ± 2 K |
Ambient diffraction temperature | 296 ± 2 K |
Number of distinct elements | 6 |
Space group number | 14 |
Hermann-Mauguin space group symbol | P 1 21/n 1 |
Hall space group symbol | -P 2yn |
Residual factor for all reflections | 0.0802 |
Residual factor for significantly intense reflections | 0.0544 |
Weighted residual factors for significantly intense reflections | 0.1148 |
Weighted residual factors for all reflections included in the refinement | 0.1299 |
Goodness-of-fit parameter for all reflections included in the refinement | 1.043 |
Diffraction radiation wavelength | 0.71073 Å |
Diffraction radiation type | MoKα |