Information card for entry 7221796
Formula | C54 H46 Co3 N8 O24 |
Calculated formula | C54 H42 Co3 N8 O22 |
Title of publication | Polycarboxylate-directed various Co(ii) complexes based on a “V”-like bis-pyridyl-bis-amide derivative: construction, electrochemical and photocatalytic properties |
Authors of publication | Wang, Xiu-Li; Sha, Xiao-Ting; Liu, Guo-Cheng; Chen, Nai-Li; Tian, Yuan |
Journal of publication | CrystEngComm |
Year of publication | 2015 |
Journal volume | 17 |
Journal issue | 38 |
Pages of publication | 7290 |
a | 12.6867 ± 0.0007 Å |
b | 27.5595 ± 0.0015 Å |
c | 15.8184 ± 0.0008 Å |
α | 90° |
β | 90° |
γ | 90° |
Cell volume | 5530.7 ± 0.5 Å3 |
Cell temperature | 296 ± 2 K |
Ambient diffraction temperature | 296 ± 2 K |
Number of distinct elements | 5 |
Space group number | 60 |
Hermann-Mauguin space group symbol | P b c n |
Hall space group symbol | -P 2n 2ab |
Residual factor for all reflections | 0.0941 |
Residual factor for significantly intense reflections | 0.0783 |
Weighted residual factors for significantly intense reflections | 0.1602 |
Weighted residual factors for all reflections included in the refinement | 0.1676 |
Goodness-of-fit parameter for all reflections included in the refinement | 1.001 |
Diffraction radiation wavelength | 0.71073 Å |
Diffraction radiation type | MoKα |