Information card for entry 7221799
Chemical name | Triaqua-tris(bis(trifluoromethylsulfonyl)imide-O,O')-praseodymium(iii) |
Formula | C6 H6 F18 N3 O15 Pr S6 |
Calculated formula | C6 F18 N3 O15 Pr S6 |
SMILES | C(F)(F)(F)S1(=NS(=O)(=[O][Pr]23(O1)([OH2])([OH2])([OH2])([O]=S(C(F)(F)F)(N=S(=O)(O2)C(F)(F)F)=O)[O]=S(C(F)(F)F)(N=S(=O)(O3)C(F)(F)F)=O)C(F)(F)F)=O |
Title of publication | Crystal structures of hydrated rare-earth bis(trifluoromethylsulfonyl)imide salts |
Authors of publication | Vander Hoogerstraete, Tom; Brooks, Neil R.; Onghena, Bieke; Van Meervelt, Luc; Binnemans, Koen |
Journal of publication | CrystEngComm |
Year of publication | 2015 |
Journal volume | 17 |
Journal issue | 37 |
Pages of publication | 7142 |
a | 18.53745 ± 0.00008 Å |
b | 18.53745 ± 0.00008 Å |
c | 18.53745 ± 0.00008 Å |
α | 90° |
β | 90° |
γ | 90° |
Cell volume | 6370.15 ± 0.05 Å3 |
Cell temperature | 100 ± 2 K |
Ambient diffraction temperature | 100 ± 2 K |
Number of distinct elements | 7 |
Space group number | 198 |
Hermann-Mauguin space group symbol | P 21 3 |
Hall space group symbol | P 2ac 2ab 3 |
Residual factor for all reflections | 0.0542 |
Residual factor for significantly intense reflections | 0.0519 |
Weighted residual factors for significantly intense reflections | 0.1233 |
Weighted residual factors for all reflections included in the refinement | 0.1244 |
Goodness-of-fit parameter for all reflections included in the refinement | 1.185 |
Diffraction radiation wavelength | 0.71073 Å |
Diffraction radiation type | MoKα |