Information card for entry 7221800
Chemical name | Triaqua-tris(bis(trifluoromethylsulfonyl)imide-O,O')-lanthanum(iii)hemi(pentahydrate) |
Formula | C6 H11 F18 La N3 O17.5 S6 |
Calculated formula | C6 F18 La N3 O17.52 S6 |
Title of publication | Crystal structures of hydrated rare-earth bis(trifluoromethylsulfonyl)imide salts |
Authors of publication | Vander Hoogerstraete, Tom; Brooks, Neil R.; Onghena, Bieke; Van Meervelt, Luc; Binnemans, Koen |
Journal of publication | CrystEngComm |
Year of publication | 2015 |
Journal volume | 17 |
Journal issue | 37 |
Pages of publication | 7142 |
a | 15.5598 ± 0.0015 Å |
b | 15.5598 ± 0.0015 Å |
c | 8.2562 ± 0.0009 Å |
α | 90° |
β | 90° |
γ | 120° |
Cell volume | 1731.1 ± 0.3 Å3 |
Cell temperature | 100 ± 2 K |
Ambient diffraction temperature | 100 ± 2 K |
Number of distinct elements | 7 |
Space group number | 147 |
Hermann-Mauguin space group symbol | P -3 |
Hall space group symbol | -P 3 |
Residual factor for all reflections | 0.099 |
Residual factor for significantly intense reflections | 0.095 |
Weighted residual factors for significantly intense reflections | 0.2136 |
Weighted residual factors for all reflections included in the refinement | 0.2155 |
Goodness-of-fit parameter for all reflections included in the refinement | 1.187 |
Diffraction radiation wavelength | 0.71073 Å |
Diffraction radiation type | MoKα |