Information card for entry 7221863
Formula | F13 O5 Sr4 V3 |
Calculated formula | F13 O5 Sr4 V3 |
Title of publication | Synthetic strategies for new vanadium oxyfluorides containing novel building blocks: structures of V(iv) and V(v) containing Sr4V3O5F13, Pb7V4O8F18, Pb2VO2F5, and Pb2VOF6 |
Authors of publication | Yeon, Jeongho; Felder, Justin B.; Smith, Mark D.; Morrison, Gregory; zur Loye, Hans-Conrad |
Journal of publication | CrystEngComm |
Year of publication | 2015 |
Journal volume | 17 |
Journal issue | 44 |
Pages of publication | 8428 |
a | 9.7805 ± 0.0007 Å |
b | 7.2405 ± 0.0005 Å |
c | 10.0361 ± 0.0007 Å |
α | 90° |
β | 108.917 ± 0.002° |
γ | 90° |
Cell volume | 672.33 ± 0.08 Å3 |
Cell temperature | 100 ± 2 K |
Ambient diffraction temperature | 100 ± 2 K |
Number of distinct elements | 4 |
Space group number | 14 |
Hermann-Mauguin space group symbol | P 1 21/n 1 |
Hall space group symbol | -P 2yn |
Residual factor for all reflections | 0.0398 |
Residual factor for significantly intense reflections | 0.0298 |
Weighted residual factors for significantly intense reflections | 0.0576 |
Weighted residual factors for all reflections included in the refinement | 0.0606 |
Goodness-of-fit parameter for all reflections included in the refinement | 1.03 |
Diffraction radiation wavelength | 0.71073 Å |
Diffraction radiation type | MoKα |