Information card for entry 7221864
Formula | F18 O8 Pb7 V4 |
Calculated formula | F18 O8 Pb7 V4 |
Title of publication | Synthetic strategies for new vanadium oxyfluorides containing novel building blocks: structures of V(iv) and V(v) containing Sr4V3O5F13, Pb7V4O8F18, Pb2VO2F5, and Pb2VOF6 |
Authors of publication | Yeon, Jeongho; Felder, Justin B.; Smith, Mark D.; Morrison, Gregory; zur Loye, Hans-Conrad |
Journal of publication | CrystEngComm |
Year of publication | 2015 |
Journal volume | 17 |
Journal issue | 44 |
Pages of publication | 8428 |
a | 10.1963 ± 0.0007 Å |
b | 7.3172 ± 0.0005 Å |
c | 13.9271 ± 0.001 Å |
α | 90° |
β | 99.057 ± 0.002° |
γ | 90° |
Cell volume | 1026.12 ± 0.12 Å3 |
Cell temperature | 100 ± 2 K |
Ambient diffraction temperature | 100 ± 2 K |
Number of distinct elements | 4 |
Space group number | 14 |
Hermann-Mauguin space group symbol | P 1 21/n 1 |
Hall space group symbol | -P 2yn |
Residual factor for all reflections | 0.0368 |
Residual factor for significantly intense reflections | 0.0306 |
Weighted residual factors for significantly intense reflections | 0.0678 |
Weighted residual factors for all reflections included in the refinement | 0.0703 |
Goodness-of-fit parameter for all reflections included in the refinement | 1.101 |
Diffraction radiation wavelength | 0.71073 Å |
Diffraction radiation type | MoKα |