Information card for entry 7221897
Chemical name | Poly{[tris(mu4-4,4'-azobenzenedicarboxylate-kO:kO,O':kO'':kO'',O''')bis(dimethylformamide)tricadmium(II)]} |
Formula | C48 H38 Cd3 N8 O14 |
Calculated formula | C48 H38 Cd3 N8 O14 |
Title of publication | Tuning the porosity through interpenetration of azobenzene-4,4′-dicarboxylate-based metal‒organic frameworks |
Authors of publication | Fernández, Belén; Seco, José Manuel; Cepeda, Javier; Calahorro, Antonio J.; Rodríguez-Diéguez, Antonio |
Journal of publication | CrystEngComm |
Year of publication | 2015 |
Journal volume | 17 |
Journal issue | 40 |
Pages of publication | 7636 |
a | 10.7515 ± 0.0007 Å |
b | 10.7424 ± 0.0007 Å |
c | 11.0098 ± 0.0008 Å |
α | 95.683 ± 0.002° |
β | 96.94 ± 0.002° |
γ | 96.596 ± 0.002° |
Cell volume | 1245.68 ± 0.15 Å3 |
Cell temperature | 100 ± 2 K |
Ambient diffraction temperature | 100 ± 2 K |
Number of distinct elements | 5 |
Space group number | 2 |
Hermann-Mauguin space group symbol | P -1 |
Hall space group symbol | -P 1 |
Residual factor for all reflections | 0.0193 |
Residual factor for significantly intense reflections | 0.0176 |
Weighted residual factors for significantly intense reflections | 0.0425 |
Weighted residual factors for all reflections included in the refinement | 0.0433 |
Goodness-of-fit parameter for all reflections included in the refinement | 1.068 |
Diffraction radiation wavelength | 0.71073 Å |
Diffraction radiation type | MoKα |