Information card for entry 7221898
Chemical name | Poly{[(mu3-4,4'-azobenzenedicarboxylate-kO:kO':kO'')(mu-3,6-bis(4-pyridyl)-1,2,4,5-tetrazine)zinc(II)]} |
Formula | C20 H12 N5 O4 Zn |
Calculated formula | C20 H12 N5 O4 Zn |
Title of publication | Tuning the porosity through interpenetration of azobenzene-4,4′-dicarboxylate-based metal‒organic frameworks |
Authors of publication | Fernández, Belén; Seco, José Manuel; Cepeda, Javier; Calahorro, Antonio J.; Rodríguez-Diéguez, Antonio |
Journal of publication | CrystEngComm |
Year of publication | 2015 |
Journal volume | 17 |
Journal issue | 40 |
Pages of publication | 7636 |
a | 6.981 ± 0.001 Å |
b | 26.778 ± 0.004 Å |
c | 13.66 ± 0.002 Å |
α | 90° |
β | 98.15 ± 0.005° |
γ | 90° |
Cell volume | 2527.8 ± 0.6 Å3 |
Cell temperature | 100 ± 2 K |
Ambient diffraction temperature | 100 ± 2 K |
Number of distinct elements | 5 |
Space group number | 14 |
Hermann-Mauguin space group symbol | P 1 21/c 1 |
Hall space group symbol | -P 2ybc |
Residual factor for all reflections | 0.1002 |
Residual factor for significantly intense reflections | 0.0612 |
Weighted residual factors for significantly intense reflections | 0.1436 |
Weighted residual factors for all reflections included in the refinement | 0.156 |
Goodness-of-fit parameter for all reflections included in the refinement | 1.006 |
Diffraction radiation wavelength | 0.71073 Å |
Diffraction radiation type | MoKα |