Information card for entry 7221959
Common name | Icariin |
Formula | C34.5 H43 O15.5 |
Calculated formula | C34.5 H43 O15.5 |
SMILES | O[C@H]1[C@@H](O[C@@H](Oc2c(=O)c3c(O)cc(O[C@@H]4O[C@@H]([C@H]([C@H](O)[C@H]4O)O)CO)c(c3oc2c2ccc(OC)cc2)CC=C(C)C)[C@H](O)[C@@H]1O)C.C(=O)(C)C |
Title of publication | Versatile solid modifications of icariin: structure, properties and form transformation |
Authors of publication | Jia, Lina; Zhang, Qi; Wang, Jian-Rong; Mei, Xuefeng |
Journal of publication | CrystEngComm |
Year of publication | 2015 |
Journal volume | 17 |
Journal issue | 39 |
Pages of publication | 7500 |
a | 9.8352 ± 0.0006 Å |
b | 22.9018 ± 0.0013 Å |
c | 31.1702 ± 0.0016 Å |
α | 90° |
β | 90° |
γ | 90° |
Cell volume | 7020.9 ± 0.7 Å3 |
Cell temperature | 296 ± 2 K |
Ambient diffraction temperature | 296 ± 2 K |
Number of distinct elements | 3 |
Space group number | 19 |
Hermann-Mauguin space group symbol | P 21 21 21 |
Hall space group symbol | P 2ac 2ab |
Residual factor for all reflections | 0.1096 |
Residual factor for significantly intense reflections | 0.0596 |
Weighted residual factors for significantly intense reflections | 0.1369 |
Weighted residual factors for all reflections included in the refinement | 0.1596 |
Goodness-of-fit parameter for all reflections included in the refinement | 1.033 |
Diffraction radiation wavelength | 0.71073 Å |
Diffraction radiation type | MoKα |