Information card for entry 7221960
Formula | C37 H48 O17 |
Calculated formula | C37 H46 O17 |
SMILES | O[C@@H]1[C@@H](O)[C@H](Oc2c(c3oc(c(O[C@@H]4O[C@H]([C@H](O)[C@@H](O)[C@H]4O)C)c(=O)c3c(O)c2)c2ccc(OC)cc2)CC=C(C)C)O[C@@H]([C@H]1O)CO.O1CCOCC1 |
Title of publication | Versatile solid modifications of icariin: structure, properties and form transformation |
Authors of publication | Jia, Lina; Zhang, Qi; Wang, Jian-Rong; Mei, Xuefeng |
Journal of publication | CrystEngComm |
Year of publication | 2015 |
Journal volume | 17 |
Journal issue | 39 |
Pages of publication | 7500 |
a | 9.7888 ± 0.0002 Å |
b | 22.9845 ± 0.0006 Å |
c | 31.9792 ± 0.0006 Å |
α | 90° |
β | 90° |
γ | 90° |
Cell volume | 7195 ± 0.3 Å3 |
Cell temperature | 130 ± 2 K |
Ambient diffraction temperature | 130 ± 2 K |
Number of distinct elements | 3 |
Space group number | 19 |
Hermann-Mauguin space group symbol | P 21 21 21 |
Hall space group symbol | P 2ac 2ab |
Residual factor for all reflections | 0.0987 |
Residual factor for significantly intense reflections | 0.0595 |
Weighted residual factors for significantly intense reflections | 0.138 |
Weighted residual factors for all reflections included in the refinement | 0.165 |
Goodness-of-fit parameter for all reflections included in the refinement | 1.009 |
Diffraction radiation wavelength | 0.71073 Å |
Diffraction radiation type | MoKα |