Information card for entry 7221961
Common name | Icariin |
Formula | C35 H46 O16 |
Calculated formula | C35 H46 O16 |
SMILES | O(C)c1ccc(c2oc3c(c(O[C@@H]4O[C@@H]([C@@H](O)[C@H](O)[C@H]4O)CO)cc(O)c3c(=O)c2O[C@@H]2O[C@H]([C@H](O)[C@@H](O)[C@H]2O)C)CC=C(C)C)cc1.OCC |
Title of publication | Versatile solid modifications of icariin: structure, properties and form transformation |
Authors of publication | Jia, Lina; Zhang, Qi; Wang, Jian-Rong; Mei, Xuefeng |
Journal of publication | CrystEngComm |
Year of publication | 2015 |
Journal volume | 17 |
Journal issue | 39 |
Pages of publication | 7500 |
a | 9.822 ± 0.0008 Å |
b | 22.9864 ± 0.0017 Å |
c | 31.274 ± 0.003 Å |
α | 90° |
β | 90° |
γ | 90° |
Cell volume | 7060.8 ± 1 Å3 |
Cell temperature | 296 ± 2 K |
Ambient diffraction temperature | 296 ± 2 K |
Number of distinct elements | 3 |
Space group number | 19 |
Hermann-Mauguin space group symbol | P 21 21 21 |
Hall space group symbol | P 2ac 2ab |
Residual factor for all reflections | 0.1603 |
Residual factor for significantly intense reflections | 0.0676 |
Weighted residual factors for significantly intense reflections | 0.1352 |
Weighted residual factors for all reflections included in the refinement | 0.1743 |
Goodness-of-fit parameter for all reflections included in the refinement | 0.985 |
Diffraction radiation wavelength | 0.71073 Å |
Diffraction radiation type | MoKα |