Information card for entry 7222023
Formula | C32 H24 N4 O8 S Zn |
Calculated formula | C32 H22 N4 O8 S Zn |
Title of publication | A series of entangled coordination polymers assembled by a V-shaped bisimidazole ligand and various dicarboxylic acids: synthesis, characterization and luminescence properties |
Authors of publication | Guo, Huadong; Yan, Yongnian; Wang, Nan; Guo, Xianmin; Zheng, Guoli; Qi, Yanjuan |
Journal of publication | CrystEngComm |
Year of publication | 2015 |
Journal volume | 17 |
Journal issue | 34 |
Pages of publication | 6512 |
a | 24.0679 ± 0.0011 Å |
b | 17.2213 ± 0.0007 Å |
c | 14.2795 ± 0.0006 Å |
α | 90° |
β | 90.854 ± 0.001° |
γ | 90° |
Cell volume | 5917.9 ± 0.4 Å3 |
Cell temperature | 293 ± 2 K |
Ambient diffraction temperature | 293 ± 2 K |
Number of distinct elements | 6 |
Space group number | 15 |
Hermann-Mauguin space group symbol | C 1 2/c 1 |
Hall space group symbol | -C 2yc |
Residual factor for all reflections | 0.0719 |
Residual factor for significantly intense reflections | 0.0418 |
Weighted residual factors for significantly intense reflections | 0.1129 |
Weighted residual factors for all reflections included in the refinement | 0.1414 |
Goodness-of-fit parameter for all reflections included in the refinement | 1.058 |
Diffraction radiation wavelength | 0.71073 Å |
Diffraction radiation type | MoKα |