Information card for entry 7222024
Formula | C64 H54 N8 O21 S4 Zn2 |
Calculated formula | C64 H48 N8 O21 S4 Zn2 |
Title of publication | A series of entangled coordination polymers assembled by a V-shaped bisimidazole ligand and various dicarboxylic acids: synthesis, characterization and luminescence properties |
Authors of publication | Guo, Huadong; Yan, Yongnian; Wang, Nan; Guo, Xianmin; Zheng, Guoli; Qi, Yanjuan |
Journal of publication | CrystEngComm |
Year of publication | 2015 |
Journal volume | 17 |
Journal issue | 34 |
Pages of publication | 6512 |
a | 14.2687 ± 0.0007 Å |
b | 15.7567 ± 0.0007 Å |
c | 16.2206 ± 0.0007 Å |
α | 67.915 ± 0.001° |
β | 79.632 ± 0.001° |
γ | 73.899 ± 0.001° |
Cell volume | 3234.9 ± 0.3 Å3 |
Cell temperature | 293 ± 2 K |
Ambient diffraction temperature | 293 ± 2 K |
Number of distinct elements | 6 |
Space group number | 2 |
Hermann-Mauguin space group symbol | P -1 |
Hall space group symbol | -P 1 |
Residual factor for all reflections | 0.0651 |
Residual factor for significantly intense reflections | 0.0434 |
Weighted residual factors for significantly intense reflections | 0.1198 |
Weighted residual factors for all reflections included in the refinement | 0.1359 |
Goodness-of-fit parameter for all reflections included in the refinement | 1.109 |
Diffraction radiation wavelength | 0.71073 Å |
Diffraction radiation type | MoKα |