Information card for entry 7222026
Formula | C60 H44 Cd2 N8 O16 S2 |
Calculated formula | C60 H40 Cd2 N8 O16 S2 |
Title of publication | A series of entangled coordination polymers assembled by a V-shaped bisimidazole ligand and various dicarboxylic acids: synthesis, characterization and luminescence properties |
Authors of publication | Guo, Huadong; Yan, Yongnian; Wang, Nan; Guo, Xianmin; Zheng, Guoli; Qi, Yanjuan |
Journal of publication | CrystEngComm |
Year of publication | 2015 |
Journal volume | 17 |
Journal issue | 34 |
Pages of publication | 6512 |
a | 20.327 ± 0.009 Å |
b | 10.439 ± 0.005 Å |
c | 28.387 ± 0.012 Å |
α | 90° |
β | 103.948 ± 0.008° |
γ | 90° |
Cell volume | 5846 ± 5 Å3 |
Cell temperature | 293 ± 2 K |
Ambient diffraction temperature | 293 ± 2 K |
Number of distinct elements | 6 |
Space group number | 15 |
Hermann-Mauguin space group symbol | C 1 2/c 1 |
Hall space group symbol | -C 2yc |
Residual factor for all reflections | 0.0814 |
Residual factor for significantly intense reflections | 0.0441 |
Weighted residual factors for significantly intense reflections | 0.1138 |
Weighted residual factors for all reflections included in the refinement | 0.1396 |
Goodness-of-fit parameter for all reflections included in the refinement | 1.036 |
Diffraction radiation wavelength | 0.71073 Å |
Diffraction radiation type | MoKα |