Information card for entry 7222025
Formula | C64 H50 Cd2 N8 O15 S2 |
Calculated formula | C64 H44 Cd2 N8 O15 S2 |
Title of publication | A series of entangled coordination polymers assembled by a V-shaped bisimidazole ligand and various dicarboxylic acids: synthesis, characterization and luminescence properties |
Authors of publication | Guo, Huadong; Yan, Yongnian; Wang, Nan; Guo, Xianmin; Zheng, Guoli; Qi, Yanjuan |
Journal of publication | CrystEngComm |
Year of publication | 2015 |
Journal volume | 17 |
Journal issue | 34 |
Pages of publication | 6512 |
a | 22.7246 ± 0.0008 Å |
b | 18.9485 ± 0.0007 Å |
c | 13.5373 ± 0.0005 Å |
α | 90° |
β | 93.8 ± 0.001° |
γ | 90° |
Cell volume | 5816.3 ± 0.4 Å3 |
Cell temperature | 293 ± 2 K |
Ambient diffraction temperature | 293 ± 2 K |
Number of distinct elements | 6 |
Space group number | 15 |
Hermann-Mauguin space group symbol | C 1 2/c 1 |
Hall space group symbol | -C 2yc |
Residual factor for all reflections | 0.054 |
Residual factor for significantly intense reflections | 0.0392 |
Weighted residual factors for significantly intense reflections | 0.1183 |
Weighted residual factors for all reflections included in the refinement | 0.141 |
Goodness-of-fit parameter for all reflections included in the refinement | 1.108 |
Diffraction radiation wavelength | 0.71073 Å |
Diffraction radiation type | MoKα |