Information card for entry 7222034
Formula | C30 H37 N O3 |
Calculated formula | C30 H36.83 N O3 |
Title of publication | Structural transformations in crystals induced by radiation and pressure. Part 2. The path of a photochemical intramolecular reaction in crystals at different pressures |
Authors of publication | Konieczny, K.; Bąkowicz, J.; Turowska-Tyrk, I. |
Journal of publication | CrystEngComm |
Year of publication | 2015 |
Journal volume | 17 |
Journal issue | 40 |
Pages of publication | 7693 |
a | 5.8654 ± 0.0012 Å |
b | 8.2731 ± 0.001 Å |
c | 25.827 ± 0.009 Å |
α | 90.2 ± 0.019° |
β | 83.68 ± 0.03° |
γ | 75.915 ± 0.015° |
Cell volume | 1207.6 ± 0.5 Å3 |
Cell temperature | 299 ± 2 K |
Ambient diffraction temperature | 299 ± 2 K |
Ambient diffracton pressure | 900000 kPa |
Number of distinct elements | 4 |
Space group number | 2 |
Hermann-Mauguin space group symbol | P -1 |
Hall space group symbol | -P 1 |
Residual factor for all reflections | 0.2835 |
Residual factor for significantly intense reflections | 0.1415 |
Weighted residual factors for significantly intense reflections | 0.324 |
Weighted residual factors for all reflections included in the refinement | 0.4244 |
Goodness-of-fit parameter for all reflections included in the refinement | 1.234 |
Diffraction radiation wavelength | 0.71073 Å |
Diffraction radiation type | MoKα |